[Gambas-user] openSUSE 10.2 (X86-64) and gambas can not compile
Jeffrey Johnson
jeffreyjohnson at ...1747...
Sat Aug 4 23:10:34 CEST 2007
I know more than likely everyone has explained this a million times. I have
never had a problem with the 32bit SuSE, but this is the only problem I have
with the 64 bit. I have a couple of ham radio programs that I now can nor
use.
Here is the where the error appears in the make install, obvious occured
during the make.
/usr/lib64/gcc/x86_64-suse-linux/4.1.2/../../../../x86_64-suse-linux/bin/ld:
skipping incompatible /usr/lib/libpthread.so when searching for -lpthread
/usr/lib64/gcc/x86_64-suse-linux/4.1.2/../../../../x86_64-suse-linux/bin/ld:
skipping incompatible /usr/lib/libpthread.a when searching for -lpthread
/usr/lib64/gcc/x86_64-suse-linux/4.1.2/../../../../x86_64-suse-linux/bin/ld:
skipping incompatible /usr/lib//libpthread.so when searching for -lpthread
/usr/lib64/gcc/x86_64-suse-linux/4.1.2/../../../../x86_64-suse-linux/bin/ld:
skipping incompatible /usr/lib//libpthread.a when searching for -lpthread
/usr/lib/qt3/lib/libqt-mt.so: could not read symbols: File in wrong format
collect2: ld returned 1 exit status
make[4]: *** [lib.gb.qt.editor.la] Error 1
make[4]: Leaving directory `/home/jeffjohnson/gambas-1.0.19/src/lib/qt/editor'
make[3]: *** [install-recursive] Error 1
make[3]: Leaving directory `/home/jeffjohnson/gambas-1.0.19/src/lib/qt'
make[2]: *** [install-recursive] Error 1
make[2]: Leaving directory `/home/jeffjohnson/gambas-1.0.19/src/lib'
make[1]: *** [install-recursive] Error 1
make[1]: Leaving directory `/home/jeffjohnson/gambas-1.0.19/src'
make: *** [install-recursive] Error 1
linux-3sza:/home/jeffjohnson/gambas-1.0.19 #
Any ideas of where I messed up, or what I forgot to install or de-install?
More information about the User
mailing list