[Gambas-user] Problems compiling under RH9 (still)
Charles Lindahl
clindahl at ...127...
Tue May 6 00:04:52 CEST 2003
All:
I can't make GAMBAS on RedHat 9 either. This is a
re-submission of an earlier report by the "other"
Charlie :-) about version 0.54.
To whomever: is there any other detail I can send or
things I can/should do to help debug/fix this?
Charlie Lindahl (different Charlie :-)
Technical Webmaster
Texas A&M University System
Health Science Center
Houston, TX
================================================
Making symbolic links in /usr/bin...
Compiling and installing the development environment...
Compiling gambas...
OK
Compiling gambas-database-manager...
OK
Creating the library info files...
/opt/gambas/lib/info/gb.info
/opt/gambas/lib/info/gb.eval.info
/opt/gambas/lib/info/gb.example.info
/opt/gambas/lib/info/gb.db.info
/opt/gambas/lib/lib.gb.qt.editor.la: /usr/lib/qt-3.1/lib/libqt-mt.so.3:
undefine
d symbol: _ZNSs4_Rep11_S_terminalE
make[2]: *** [install-exec-local] Error 1
make[2]: Leaving directory `/home/clindahl/downloaded/gambas/gambas-0.55'
make[1]: *** [install-am] Error 2
make[1]: Leaving directory `/home/clindahl/downloaded/gambas/gambas-0.55'
make: *** [install-recursive] Error 1
More information about the User
mailing list