[Gambas-user] Error compiling devel

gian bagoneo at libero.it
Sat Sep 3 23:08:59 CEST 2022

Hi Benoit,

Compiling from git the latest devel version, I get this error on the 
make command:

csvgimage.cpp: In function ‘const char* load_file(CSVGIMAGE*, const 
char*, int)’:
csvgimage.cpp:145:2: error: ‘rsvg_handle_get_intrinsic_size_in_pixels’ 
was not declared in this scope; did you mean 
   145 |  rsvg_handle_get_intrinsic_size_in_pixels(handle, &THIS->width, 
       |  ^~~~~~~~~~~~~~~~~~~~~~~~~~~~~~~~~~~~~~~~
       |  rsvg_handle_get_intrinsic_dimensions
make[5]: *** [Makefile:1202: gb_gtk_la-csvgimage.lo] Errore 1
make[5]: uscita dalla directory «/home/gian/gambasdevel/gb.gtk/src»
make[4]: *** [Makefile:1327: all-recursive] Errore 1
make[4]: uscita dalla directory «/home/gian/gambasdevel/gb.gtk/src»
make[3]: *** [Makefile:449: all-recursive] Errore 1
make[3]: uscita dalla directory «/home/gian/gambasdevel/gb.gtk»
make[2]: *** [Makefile:381: all] Errore 2
make[2]: uscita dalla directory «/home/gian/gambasdevel/gb.gtk»
make[1]: *** [Makefile:443: all-recursive] Errore 1
make[1]: uscita dalla directory «/home/gian/gambasdevel»
make: *** [Makefile:384: all] Errore 2


More information about the User mailing list